1. AC Question's Avatar
    :CordovaLibrocessReleaseResources FAILED

    BUILD FAILED
    FAILURE: Build failed with an exception.

    * What went wrong:
    Execution failed for task ':CordovaLibrocessReleaseResources'.
    > com.android.ide.common.process.ProcessException: org.gradle.process.internal.ExecException: Process 'command 'C:\Users\hamza\AppData\Local\Android\sdk\build-tools\23.0.3\aapt.exe'' finished with non-zero exit value 1

    * Try:
    Run with --stacktrace option to get the stack trace. Run with --info or --debug option to get more log output.

    Total time: 46.269 secs
    => Errors executing Cordova commands:

    While building Cordova app for platform Android:
    Error code 1 for command: cmd with args:
    /s,/c,"C:\Users\hamza\Desktop\nows\buysellmobileapp\codecanyon-16573615-buy-sell-mobile-app-full-application-with-meteor-and-ionic\tapshop-files\tapshop\.meteor\local\cordova-build\platforms\android\gradlew
    cdvBuildRelease -b
    C:\Users\hamza\Desktop\nows\buysellmobileapp\codecanyon-16573615-buy-sell-mobile-app-full-application-with-meteor-and-ionic\tapshop-files\tapshop\.meteor\local\cordova-build\platforms\android\build.gradle
    -Dorg.gradle.daemon=true -Pandroid.useDeprecatedNdk=true"

    => Build Error. Check the logs printed above.
    02-17-2017 10:23 AM

Similar Threads

  1. Replies: 2
    Last Post: 02-17-2017, 07:38 PM
  2. Replies: 1
    Last Post: 02-17-2017, 06:46 AM
  3. Replies: 0
    Last Post: 02-17-2017, 02:15 AM
LINK TO POST COPIED TO CLIPBOARD